{"text_format":"1","workbook":"xlsx","n_sheets":15,"sheets":["Instructions","Index","Pop Data Entry","Characteristics of Target Pop","Logistics Data Entry","Logistics Data Summary","Results Dashboard","Advocacy Dashboard","Sample kits calculator","Commodity estimates","Per-Item Estimates","Product cost","Acknowledgement","Advocacy estimates ","Hidden"],"not_rendered":{"charts":15,"images":5,"macros":1,"external_links":0,"defined_names":9,"comments":3,"pivot_tables":3},"unopened":[],"bounds":{"document_bytes":16777216,"sheet_cells":100000,"rows_first":2000,"rows_last":500,"rows_between":2000,"halvings":0,"cell_chars":16384,"cell_head_chars":4096},"cells_cut":0,"cells_raw":0,"read":"whole","date_system":"1900"}

{"sheet":"Instructions","index":0,"n_rows":0,"n_cols":0,"rows_kept":0,"cut":false,"hidden":false,"merged":[]}

{"sheet":"Index","index":1,"n_rows":43,"n_cols":9,"rows_kept":43,"cut":false,"hidden":false,"merged":[[29,1,29,7],[29,8,29,25],[42,1,43,7],[39,1,40,7],[39,8,40,25],[37,1,38,7],[33,8,34,25],[35,8,36,25],[37,8,38,25],[30,1,30,25],[31,1,32,7],[31,8,32,25],[33,1,34,7],[35,1,36,7],[18,1,19,7],[27,1,28,7],[22,1,23,7],[24,1,25,7],[18,8,19,25],[27,8,28,25],[22,8,23,25],[24,8,25,25],[20,1,21,7],[20,8,21,25],[6,1,7,25],[8,1,9,7],[8,8,9,25],[10,1,10,25],[17,1,17,25],[11,1,12,7],[11,8,12,25],[15,1,16,7],[13,8,14,25],[13,1,14,7],[15,8,16,25]]}
[]
[]
[]
[]
[]
[]
[null,"TABLE OF CONTENTS"]
[]
[null,"Sheets",null,null,null,null,null,null,"Content"]
[]
{"$rows_left_out":34}
{"sheet":"Pop Data Entry","index":2,"n_rows":19,"n_cols":9,"rows_kept":19,"cut":false,"hidden":false,"merged":[[10,2,11,2],[10,3,10,5],[10,6,10,8],[0,2,2,8],[7,3,7,4],[7,5,7,6],[7,7,7,8],[8,3,8,4],[8,5,8,6],[8,7,8,8]]}
[]
[]
[]
[]
[]
[]
[]
[null,null,"Target Population","0-3 Months",null,"3-6 Months",null,"6-9 Months"]
[null,null,"Estimated target population affected by humanitarian disasters"]
[]
{"$rows_left_out":10}
{"sheet":"Characteristics of Target Pop","index":3,"n_rows":58,"n_cols":10,"rows_kept":58,"cut":false,"hidden":false,"merged":[[12,0,12,9],[35,0,35,9],[5,2,5,4],[5,6,5,8]]}
[]
[]
[]
[]
[]
[null,"Default Figures","Estimates using default figures",null,null,"Country- specific figures","Estimates using country-specific figures",null,null,"Units"]
[null,null,"0-3 Months","3-6 Months","6-9 Months",null,"0-3 Months","3-6 Months","6-9 Months"]
["Total Population",null,{"$f":"'Pop Data Entry'!D9","v":0},{"$f":"'Pop Data Entry'!F9","v":0},{"$f":"'Pop Data Entry'!H9","v":0},null,{"$f":"'Pop Data Entry'!D9","v":0},{"$f":"'Pop Data Entry'!F9","v":0},{"$f":"'Pop Data Entry'!H9","v":0},"persons"]
["Crude Birth Rate (per 1,000 population)",40,null,null,null,null,null,null,null,"persons per 1,000 population"]
["Contraceptive Prevalence Rate (%)",0.15,null,null,null,null,null,null,null,"percent"]
{"$rows_left_out":49}
{"sheet":"Logistics Data Entry","index":4,"n_rows":319,"n_cols":19,"rows_kept":319,"cut":false,"hidden":false,"merged":[[233,16,297,16],[233,17,297,17],[233,18,297,18],[300,16,317,16],[300,17,317,17],[300,18,317,18],[213,16,230,16],[213,17,230,17],[213,18,230,18],[146,16,163,16],[146,17,163,17],[146,18,163,18],[166,16,204,16],[166,17,204,17],[166,18,204,18],[85,16,124,16],[85,17,124,17],[85,18,124,18],[46,16,54,16],[46,17,54,17],[46,18,54,18],[60,16,82,16],[60,17,82,17],[60,18,82,18],[25,16,29,16],[25,17,29,17],[25,18,29,18],[32,16,43,16],[32,17,43,17],[32,18,43,18],[0,0,0,5],[0,9,0,11],[0,13,0,15],[0,16,0,18],[9,16,16,16],[9,17,16,17],[9,18,16,18],[0,6,0,7]]}
["KIT INFORMATION",null,null,null,null,null,"Historical Consumption / Quantity Issued",null,"Default Quarterly Growth Factor (Manually Adjust if Needed)","Commodity Quantity Forecast",null,null,null,"KIT ESTIMATES",null,null,"COST ESTIMATE PER KIT"]
["KIT category","Forecast Basis","Commodity","Kit application","Duration of kit use (in years)","Formulation (Unit)","Three Months Prior","Most Recent Three Months",null,"Now - 3 Months","3 - 6 Months","6 - 9 Months","Items per kit","Kit Estimate Now - 3 Months","Kit Estimate 3 - 6 Months","Kit Estimate 6 - 9 Months","Product Cost Year 1","Product Cost Year 2","Product Cost Year 3"]
["KIT 1A",null,null,"Male Condoms"]
["KIT 1A","Commodity Consumption","Male condoms",null,{"$f":"'Pop Data Entry'!$D$19","v":0.25},"condom",null,null,{"$f":"IFERROR(((H4-G4)/G4),0)","v":0},{"$f":"H4*(1+I4)","v":0},{"$f":"J4*(1+I4)","v":0},{"$f":"K4*(1+I4)","v":0},17280,{"$f":"ROUNDUP(((J4)/$M4),0)","v":0},{"$f":"ROUNDUP(((K4)/$M4),0)","v":0},{"$f":"ROUNDUP(((L4)/$M4),0)","v":0},{"$f":"N4*'Product cost'!#REF!","v":{"$error":"#REF!"}},{"$f":"O4*'Product cost'!#REF!","v":{"$error":"#REF!"}},{"$f":"P4*'Product cost'!#REF!","v":{"$error":"#REF!"}}]
["KIT 1A","Kits Issued to SDPs",null,null,null,null,null,null,{"$f":"IFERROR(((H5-G5)/G5),0)","v":0},{"$f":"H5*(1+I5)","v":0},{"$f":"J5*(1+I5)","v":0},{"$f":"K5*(1+I5)","v":0},null,{"$f":"J5","v":0},{"$f":"K5","v":0},{"$f":"L5","v":0},{"$f":"N5*'Product cost'!#REF!","v":{"$error":"#REF!"}},{"$f":"O5*'Product cost'!#REF!","v":{"$error":"#REF!"}},{"$f":"P5*'Product cost'!#REF!","v":{"$error":"#REF!"}}]
["KIT 1B (Complementary Kit)",null,null,"Female Condoms "]
["KIT 1B (Complementary Kit)","Commodity Consumption","Female condoms",null,{"$f":"'Pop Data Entry'!$D$19","v":0.25},"condom",null,null,{"$f":"IFERROR(((H7-G7)/G7),0)","v":0},{"$f":"H7*(1+I7)","v":0},{"$f":"J7*(1+I7)","v":0},{"$f":"K7*(1+I7)","v":0},540,{"$f":"ROUNDUP(((J7)/$M7),0)","v":0},{"$f":"ROUNDUP(((K7)/$M7),0)","v":0},{"$f":"ROUNDUP(((L7)/$M7),0)","v":0},{"$f":"N7*'Product cost'!#REF!","v":{"$error":"#REF!"}},{"$f":"O7*'Product cost'!#REF!","v":{"$error":"#REF!"}},{"$f":"P7*'Product cost'!#REF!","v":{"$error":"#REF!"}}]
["KIT 1B (Complementary Kit)","Kits Issued to SDPs",null,null,null,null,null,null,{"$f":"IFERROR(((H8-G8)/G8),0)","v":0},{"$f":"H8*(1+I8)","v":0},{"$f":"J8*(1+I8)","v":0},{"$f":"K8*(1+I8)","v":0},null,{"$f":"J8","v":0},{"$f":"K8","v":0},{"$f":"L8","v":0},{"$f":"N8*'Product cost'!#REF!","v":{"$error":"#REF!"}},{"$f":"O8*'Product cost'!#REF!","v":{"$error":"#REF!"}},{"$f":"P8*'Product cost'!#REF!","v":{"$error":"#REF!"}}]
["KIT 2A",null,null,"Clean Delivery"]
["Kit 2A","Commodity Consumption","Bag, plastic, approximately 18 x 28 cm, snap-lock fastening, for disposal of placenta","Part A: Individual delivery",{"$f":"'Pop Data Entry'!$D$19","v":0.25},"bag",null,null,{"$f":"IFERROR(((H10-G10)/G10),0)","v":0},{"$f":"H10*(1+I10)","v":0},{"$f":"J10*(1+I10)","v":0},{"$f":"K10*(1+I10)","v":0},200,{"$f":"ROUNDUP(((J10)/$M10),0)","v":0},{"$f":"ROUNDUP(((K10)/$M10),0)","v":0},{"$f":"ROUNDUP(((L10)/$M10),0)","v":0},{"$f":"MAX(N10:N17)*'Product cost'!#REF!","v":{"$error":"#REF!"}},{"$f":"MAX(O10:O17)*'Product cost'!#REF!","v":{"$error":"#REF!"}},{"$f":"MAX(P10:P17)*'Product cost'!#REF!","v":{"$error":"#REF!"}}]
{"$rows_left_out":310}
{"sheet":"Logistics Data Summary","index":5,"n_rows":27,"n_cols":4,"rows_kept":27,"cut":false,"hidden":true,"merged":[[0,0,2,6]]}
["LOGISTICS DATA SUMMARY"]
[]
[]
[]
[]
[]
["Kit","Current Year","Year 2","Year 3"]
["1A",{"$f":"IF(('Logistics Data Entry'!N4=0),'Logistics Data Entry'!N5,'Logistics Data Entry'!N4)","v":0},{"$f":"IF(('Logistics Data Entry'!O4=0),'Logistics Data Entry'!O5,'Logistics Data Entry'!O4)","v":0},{"$f":"IF(('Logistics Data Entry'!P4=0),'Logistics Data Entry'!P5,'Logistics Data Entry'!P4)","v":0}]
["1B",{"$f":"IF('Logistics Data Entry'!N7=0,'Logistics Data Entry'!N8,'Logistics Data Entry'!N7)","v":0},{"$f":"IF('Logistics Data Entry'!O7=0,'Logistics Data Entry'!O8,'Logistics Data Entry'!O7)","v":0},{"$f":"IF('Logistics Data Entry'!P7=0,'Logistics Data Entry'!P8,'Logistics Data Entry'!P7)","v":0}]
["2A",{"$f":"IF(MAX('Logistics Data Entry'!N10:N17)=0,'Logistics Data Entry'!N18,MAX('Logistics Data Entry'!N10:N17))","v":0},{"$f":"IF(MAX('Logistics Data Entry'!O10:O17)=0,'Logistics Data Entry'!O18,MAX('Logistics Data Entry'!O10:O17))","v":0},{"$f":"IF(MAX('Logistics Data Entry'!P10:P17)=0,'Logistics Data Entry'!P18,MAX('Logistics Data Entry'!P10:P17))","v":0}]
{"$rows_left_out":18}
{"sheet":"Results Dashboard","index":6,"n_rows":59,"n_cols":25,"rows_kept":59,"cut":false,"hidden":false,"merged":[[58,16,59,17],[58,18,59,19],[58,20,59,21],[58,22,59,23],[56,16,57,17],[56,19,57,19],[42,16,43,17],[40,18,41,18],[42,18,43,18],[40,21,41,21],[42,21,43,21],[40,20,41,20],[42,20,43,20],[48,16,49,17],[54,16,55,17],[50,16,51,17],[52,16,53,17],[48,18,49,18],[50,18,51,18],[52,18,53,18],[54,18,55,18],[56,18,57,18],[54,19,55,19],[42,19,43,19],[30,16,31,17],[34,16,35,17],[30,18,31,18],[34,18,35,18],[30,21,31,21],[34,21,35,21],[30,20,31,20],[34,20,35,20],[40,16,41,17],[30,19,31,19],[34,19,35,19],[40,19,41,19],[38,16,39,17],[36,16,37,17],[32,16,33,17],[32,21,33,21],[32,20,33,20],[32,19,33,19],[32,18,33,18],[38,21,39,21],[36,21,37,21],[38,20,39,20],[36,20,37,20],[38,19,39,19],[20,18,21,18],[20,21,21,21],[20,20,21,20],[28,16,29,17],[24,18,25,18],[28,18,29,18],[24,21,25,21],[28,21,29,21],[24,20,25,20],[28,20,29,20],[22,19,23,19],[24,19,25,19],[28,19,29,19],[26,16,27,17],[52,23,53,23],[48,22,49,22],[10,16,11,17],[8,16,9,17],[8,20,9,21],[8,22,9,23],[8,18,9,19],[10,18,11,18],[10,21,11,21],[10,20,11,20],[10,23,11,23],[10,22,11,22],[10,19,11,19],[12,16,13,17],[14,16,15,17],[12,18,13,18],[14,18,15,18],[12,21,13,21],[14,21,15,21],[12,20,13,20],[14,20,15,20],[20,16,21,17],[12,19,13,19],[14,19,15,19],[52,19,53,19],[48,20,49,20],[50,20,51,20],[52,20,53,20],[54,20,55,20],[56,20,57,20],[48,21,49,21],[50,21,51,21],[52,21,53,21],[54,21,55,21],[56,21,57,21],[12,23,13,23],[14,23,15,23],[20,23,21,23],[22,23,23,23],[24,23,25,23],[16,23,17,23],[6,16,7,26],[48,19,49,19],[50,19,51,19],[12,22,13,22],[14,22,15,22],[20,22,21,22],[22,22,23,22],[24,22,25,22],[16,22,17,22],[48,23,49,23],[50,23,51,23],[20,19,21,19],[18,16,19,17],[16,16,17,17],[16,21,17,21],[16,19,17,19],[16,20,17,20],[16,18,17,18],[50,24,51,26],[52,24,53,26],[54,24,55,26],[56,24,57,26],[28,22,29,22],[30,22,31,22],[34,22,35,22],[40,22,41,22],[42,22,43,22],[54,23,55,23],[54,22,55,22],[56,23,57,23],[56,22,57,22],[48,24,49,26],[34,24,35,26],[40,24,41,26],[42,24,43,26],[46,24,47,26],[44,24,45,26],[50,22,51,22],[52,22,53,22],[28,23,29,23],[30,23,31,23],[34,23,35,23],[10,24,11,26],[12,24,13,26],[8,24,9,26],[14,24,15,26],[20,24,21,26],[22,24,23,26],[24,24,25,26],[28,24,29,26],[30,24,31,26],[16,24,17,26],[46,16,47,17],[44,16,45,17],[32,24,33,26],[26,24,27,26],[18,24,19,26],[18,23,19,23],[18,22,19,22],[18,21,19,21],[18,19,19,19],[18,20,19,20],[18,18,19,18],[26,23,27,23],[26,22,27,22],[26,21,27,21],[26,20,27,20],[26,19,27,19],[26,18,27,18],[32,23,33,23],[32,22,33,22],[22,16,23,17],[22,18,23,18],[22,21,23,21],[22,20,23,20],[24,16,25,17],[36,19,37,19],[38,18,39,18],[36,18,37,18],[38,23,39,23],[36,23,37,23],[38,22,39,22],[36,22,37,22],[46,23,47,23],[44,23,45,23],[46,22,47,22],[44,22,45,22],[46,21,47,21],[44,21,45,21],[46,20,47,20],[44,20,45,20],[46,19,47,19],[44,19,45,19],[46,18,47,18],[44,18,45,18],[40,23,41,23],[42,23,43,23]]}
[]
[]
[]
[]
[]
[]
[null,null,null,null,null,null,null,null,null,null,null,null,null,null,null,null,"Selected RH Kit Quantities and Costs for all Kits "]
[]
[null,null,null,null,null,null,null,null,null,null,null,null,null,null,null,null,"Kit Type",null,"Next 3 Months",null,"3 - 6 Months",null,"6 - 9 Months",null,"Notes"]
[]
{"$rows_left_out":50}
{"sheet":"Advocacy Dashboard","index":7,"n_rows":0,"n_cols":0,"rows_kept":0,"cut":false,"hidden":false,"merged":[]}

{"sheet":"Sample kits calculator","index":8,"n_rows":31,"n_cols":16,"rows_kept":31,"cut":false,"hidden":true,"merged":[]}
["Key assumptions"]
["Population served by one community or primary health care facility ",{"$f":"IF('Pop Data Entry'!G13=0, 'Pop Data Entry'!D13, 'Pop Data Entry'!G13)","v":8000}]
["Population served by one primary health care center",{"$f":"IF('Pop Data Entry'!G14=0, 'Pop Data Entry'!D14, 'Pop Data Entry'!G14)","v":50000}]
["Population served by one hospital or referral care facility ",{"$f":"IF('Pop Data Entry'!G15=0, 'Pop Data Entry'!D15, 'Pop Data Entry'!G15)","v":30000}]
[]
["Estimated Global population affected by humanitarian disasters",{"$f":"IF('Characteristics of Target Pop'!G8=0, 'Characteristics of Target Pop'!C8, 'Characteristics of Target Pop'!G8)","v":0}]
["Number of community and primary health care facilities to be equipped for RH response per 10,000 population",{"$f":"$B$6/B2","v":0}]
["Number of health centers to be equipped for RH response per 30,000 population",{"$f":"$B$6/B3","v":0}]
["Number of referral hospitals per 150,000 population",{"$f":"$B$6/B4","v":0}]
[]
{"$rows_left_out":22}
{"sheet":"Commodity estimates","index":9,"n_rows":396,"n_cols":21,"rows_kept":396,"cut":false,"hidden":false,"merged":[[377,18,394,18],[377,19,394,19],[377,20,394,20],[266,18,308,18],[266,19,308,19],[266,20,308,20],[310,18,374,18],[310,19,374,19],[310,20,374,20],[116,20,168,20],[116,19,168,19],[116,18,168,18],[244,18,261,18],[244,19,261,19],[244,20,261,20],[197,18,235,18],[197,19,235,19],[197,20,235,20],[177,18,194,18],[177,19,194,19],[177,20,194,20],[9,18,16,18],[9,19,16,19],[9,20,16,20],[25,18,29,18],[25,19,29,19],[25,20,29,20],[32,18,43,18],[32,19,43,19],[32,20,43,20],[46,18,54,18],[46,19,54,19],[46,20,54,20],[0,18,0,20],[0,9,0,11],[0,15,0,17],[0,0,0,5],[0,6,0,8],[60,18,82,18],[60,19,82,19],[60,20,82,20],[85,18,112,18],[85,19,112,19],[85,20,112,20]]}
["KIT INFORMATION",null,null,null,null,null,"DOSAGE AND TREATMENT",null,null,"CLIENT LOAD PER HEALTH CONDITION",null,null,null,null,null,"KIT ESTIMATES",null,null,"COST ESTIMATE PER KIT"]
["KIT category","Forecast","Product(s) per kit","Kit use","Duration of kit use (in years)","Formulation","Dosage","Treatment duration (days)","Product quantity","Client load Now - 3 Months","Client load 3 - 6 Months","Client load 6 - 9 Months","Required items per kit (per WHO treatment plan","Items per kit","Target Pop per Item","Kit Estimate Now - 3 Months","Kit Estimate 3 - 6 Months","Kit Estimate 6 - 9 Months","Product Cost Now - 3 Months","Product Cost 3 - 6 Months","Product Cost 6 - 9 Months"]
["KIT 1A",null,null,"Male Condoms"]
["KIT 1A","Demographic","Male condoms",null,{"$f":"'Pop Data Entry'!$D$19","v":0.25},"condom",{"$f":"12/30","v":0.4},90,{"$f":"G4*H4","v":36},{"$f":"IF('Characteristics of Target Pop'!G46>0, 'Characteristics of Target Pop'!G46, 'Characteristics of Target Pop'!C46)","v":0},{"$f":"IF('Characteristics of Target Pop'!H46>0, 'Characteristics of Target Pop'!H46, 'Characteristics of Target Pop'!D46)","v":0},{"$f":"IF('Characteristics of Target Pop'!I46>0, 'Characteristics of Target Pop'!I46, 'Characteristics of Target Pop'!E46)","v":0},17280,17280,1,{"$f":"ROUNDUP(((J4*$I$4)/$N$4),0)","v":0},{"$f":"ROUNDUP(((K4*$I$4)/$N$4),0)","v":0},{"$f":"ROUNDUP(((L4*$I$4)/$N$4),0)","v":0},{"$f":"P4*'Product cost'!$E$5","v":0},{"$f":"Q4*'Product cost'!$E$5","v":0},{"$f":"R4*'Product cost'!$E$5","v":0}]
["KIT 1A","Logistics","",null,null,null,null,null,null,null,null,null,null,null,null,{"$f":"'Logistics Data Summary'!B8","v":0},{"$f":"'Logistics Data Summary'!C8","v":0},{"$f":"'Logistics Data Summary'!D8","v":0},{"$f":"P5*'Product cost'!$E$5","v":0},{"$f":"Q5*'Product cost'!$E$5","v":0},{"$f":"R5*'Product cost'!$E$5","v":0}]
["KIT 1B (Complementary Kit)",null,"","Female Condoms "]
["KIT 1B (Complementary Kit)","Demographic","Female condoms",null,{"$f":"'Pop Data Entry'!$D$19","v":0.25},"condom",{"$f":"6/30","v":0.2},90,{"$f":"G7*H7","v":18},{"$f":"IF('Characteristics of Target Pop'!G48>0, 'Characteristics of Target Pop'!G48, 'Characteristics of Target Pop'!C48)","v":0},{"$f":"IF('Characteristics of Target Pop'!H48>0, 'Characteristics of Target Pop'!H48, 'Characteristics of Target Pop'!D48)","v":0},{"$f":"IF('Characteristics of Target Pop'!I48>0, 'Characteristics of Target Pop'!I48, 'Characteristics of Target Pop'!E48)","v":0},540,540,1,{"$f":"ROUNDUP(((J7*$I$7)/$N$7),0)","v":0},{"$f":"ROUNDUP(((K7*$I$7)/$N$7),0)","v":0},{"$f":"ROUNDUP(((L7*$I$7)/$N$7),0)","v":0},{"$f":"P7*'Product cost'!$E$6","v":0},{"$f":"Q7*'Product cost'!$E$6","v":0},{"$f":"R7*'Product cost'!$E$6","v":0}]
["KIT 1B (Complementary Kit)","Logistics","",null,null,null,null,null,null,null,null,null,null,null,null,{"$f":"'Logistics Data Summary'!B9","v":0},{"$f":"'Logistics Data Summary'!C9","v":0},{"$f":"'Logistics Data Summary'!D9","v":0},{"$f":"P8*'Product cost'!$E$6","v":0},{"$f":"Q8*'Product cost'!$E$6","v":0},{"$f":"R8*'Product cost'!$E$6","v":0}]
["KIT 2A",null,"","Clean Delivery"]
["Kit 2A","Demographic","Bag, plastic, approximately 18 x 28 cm, snap-lock fastening, for disposal of placenta","Part A: Individual delivery",{"$f":"'Pop Data Entry'!$D$19","v":0.25},"bag",1,1,{"$f":"G10*H10","v":1},{"$f":"IF('Characteristics of Target Pop'!$G$14>0, 'Characteristics of Target Pop'!$G$14, 'Characteristics of Target Pop'!$C$14)*E10","v":0},{"$f":"IF('Characteristics of Target Pop'!$H$14>0, 'Characteristics of Target Pop'!$H$14, 'Characteristics of Target Pop'!$D$14)*E10","v":0},{"$f":"IF('Characteristics of Target Pop'!$I$14>0, 'Characteristics of Target Pop'!$I$14, 'Characteristics of Target Pop'!$E$14)*E10","v":0},200,{"$f":"200*G10","v":200},1,{"$f":"ROUNDUP(((J10*I10)/N10),0)","v":0},{"$f":"ROUNDUP(((K10*I10)/N10),0)","v":0},{"$f":"ROUNDUP(((L10*I10)/N10),0)","v":0},{"$f":"MAX(P10:P17)*'Product cost'!$E$7","v":0},{"$f":"MAX(Q10:Q17)*'Product cost'!$E$7","v":0},{"$f":"MAX(R10:R17)*'Product cost'!$E$7","v":0}]
{"$rows_left_out":387}
{"sheet":"Per-Item Estimates","index":10,"n_rows":229,"n_cols":6,"rows_kept":229,"cut":false,"hidden":false,"merged":[[1,2,1,5]]}
[]
[null,null,"Per Item Estimates (Demographic Forecast Only)"]
[]
[null,null,"Forecast","Demographic"]
[]
[null,null,"Unique Items (Kit Contents)","Month 0 - 3","Month 3 - 6","Month 6 - 9"]
[null,null,"2cc silicone packaged in bags of 10 ",0,0,0]
[null,null,"Accessory kit for MVA Plus, including (1) O-ring, (1) collarstop, (1) cap, (1) 2cc silicone",0,0,0]
[null,null,"Amoxicillin 125mg/5ml powder for oral suspension, bottle (pediatric)",0,0,0]
[null,null,"Ampicillin pdr/inj 500mg vial, ",0,0,0]
{"$rows_left_out":220}
{"sheet":"Product cost","index":11,"n_rows":29,"n_cols":7,"rows_kept":29,"cut":false,"hidden":false,"merged":[[0,2,0,6]]}
[]
[]
[null,null,"Item ID","Kit name ","Cost","Currency","Last updated"]
[null,null,"RH KIT 0","ERH Kit 0 - Administration and Training Kit",127.11,"USD","2018-09-01"]
[null,null,"RH KIT 1A","ERH Kit 1A - Male Condom Kit",475.91,"USD","2018-09-01"]
[null,null,"RH KIT 1B","ERH Kit 1B - Female Condom Kit (Complementary)",320.47000000000003,"USD","2018-09-01"]
[null,null,"RH KIT 2A","ERH Kit 2A - Clean Delivery Kit - for Individual",591.45000000000005,"USD","2018-09-01"]
[null,null,null,"Kit 2A Complement: Chlorhexidine for Cord Care"]
[null,null,null,"Kit 2A Complement: Misoprostol (Bulk)"]
[null,null,"RH KIT 2B","ERH Kit 2B Clean Delivery Kit - For use by birth attendants.",104.41,"USD","2018-09-01"]
{"$rows_left_out":20}
{"sheet":"Acknowledgement","index":12,"n_rows":27,"n_cols":4,"rows_kept":27,"cut":false,"hidden":false,"merged":[[1,18,1,19]]}
[]
[]
[]
[]
[]
[null,null,"The development of this tool was lead by:"]
[]
[null,null,null,"Henia DAKKAK (dakkak@unfpa.org), Humanitarian SRHR Advisor, UNFPA"]
[null,null,null,"Bouchta MOURABIT (mourabit@unfpa.org), Humanitarian Coordinator, UNFPA"]
[null,null,null,"Raya ALCHUKR (alchukr@unfpa.org), SRH in Emergencies Specialist, UNFPA"]
{"$rows_left_out":18}
{"sheet":"Advocacy estimates ","index":13,"n_rows":24,"n_cols":15,"rows_kept":24,"cut":false,"hidden":true,"merged":[[0,9,0,11],[0,6,0,8],[0,12,0,14]]}
[null,null,null,"YEAR ONE","YEAR TWO","YEAR THREE","Year One",null,null,"Year Two ",null,null,"Year Three"]
["ERH Kits","Name of ERH Kits ","Assumptions","Total number of kits distributed (global)","Total number of kits distributed (global)","Total number of kits distributed (global)","Total Target Pop","Direct Target","Direct Beneficiaries","Total Target Pop","Direct Target","Direct Beneficiaries","Total Target Pop","Direct Target","Direct Beneficiaries"]
["RH KIT 1A","Male Condoms","20% of pop are adult males, 20% of this group will use condoms,  each user will need 12 condoms/month for  3 months",{"$f":"'Results Dashboard'!S11","v":0},{"$f":"'Results Dashboard'!U11","v":0},{"$f":"'Results Dashboard'!W11","v":0},{"$f":"D3*10000","v":0},{"$f":"D3*2000","v":0},{"$f":"D3*400","v":0},{"$f":"E3*10000","v":0},{"$f":"E3*2000","v":0},{"$f":"E3*400","v":0},{"$f":"F3*10000","v":0},{"$f":"F3*2000","v":0},{"$f":"F3*400","v":0}]
["RH KIT 1B","Female Condoms","25% of affected pop are potentially sexually active women,  1% of this group will use female condoms (each user 6 condoms/month for  3 months)",{"$f":"'Results Dashboard'!S13","v":0},{"$f":"'Results Dashboard'!U13","v":0},{"$f":"'Results Dashboard'!W13","v":0},{"$f":"D4*10000","v":0},{"$f":"D4*2500","v":0},{"$f":"D4*25","v":0},{"$f":"E4*10000","v":0},{"$f":"E4*2500","v":0},{"$f":"E4*25","v":0},{"$f":"F4*10000","v":0},{"$f":"F4*2500","v":0},{"$f":"F4*25","v":0}]
["RH KIT 2A","Clean Delivery - Individual","with  4%  crude birth rate 100 deliveries in 3 months (and additional 100 are 6-9 months pregnant)",{"$f":"'Results Dashboard'!S15","v":0},{"$f":"'Results Dashboard'!U15","v":0},{"$f":"'Results Dashboard'!W15","v":0},0,{"$f":"D5*200","v":0},{"$f":"D5*200","v":0},0,{"$f":"E5*200","v":0},{"$f":"E5*200","v":0},0,{"$f":"F5*200","v":0},{"$f":"F5*200","v":0}]
["RH KIT 2B","Clean Delivery - For Use By Birth Attendants","5 birth attendants to get one Kit ",{"$f":"'Results Dashboard'!S21","v":0},{"$f":"'Results Dashboard'!U21","v":0},{"$f":"'Results Dashboard'!W21","v":0},0,{"$f":"D6*5","v":0},{"$f":"D6*5","v":0},0,{"$f":"E6*5","v":0},{"$f":"E6*5","v":0},0,{"$f":"F6*5","v":0},{"$f":"F6*5","v":0}]
["RH KIT 3 ","Rape Treatment"," 50 adult and 10 children survivors of rape (25% WRA + 55% Children as direct target pop)",{"$f":"'Results Dashboard'!S23","v":0},{"$f":"'Results Dashboard'!U23","v":0},{"$f":"'Results Dashboard'!W23","v":0},0,{"$f":"D7*8000","v":0},{"$f":"D7*60","v":0},0,{"$f":"E7*8000","v":0},{"$f":"E7*60","v":0},0,{"$f":"F7*8000","v":0},{"$f":"F7*60","v":0}]
["RH KIT 4","Oral & Injectable Contraception  ","15% of WRA will use contraceptive ",{"$f":"'Results Dashboard'!S25","v":0},{"$f":"'Results Dashboard'!U25","v":0},{"$f":"'Results Dashboard'!W25","v":0},0,{"$f":"D8*2500","v":0},{"$f":"D8*375","v":0},0,{"$f":"E8*2500","v":0},{"$f":"E8*375","v":0},0,{"$f":"F8*2500","v":0},{"$f":"F8*375","v":0}]
["RH KIT 5","Treatment of Sexually Transmitted Infections","50% of affected pop are adults, 5% of them may have STIs ",{"$f":"'Results Dashboard'!S29","v":0},{"$f":"'Results Dashboard'!U29","v":0},{"$f":"'Results Dashboard'!W29","v":0},0,{"$f":"D9*500","v":0},{"$f":"D9*275","v":0},0,{"$f":"E9*500","v":0},{"$f":"E9*275","v":0},0,{"$f":"F9*500","v":0},{"$f":"F9*275","v":0}]
["RHKIT 6A","Clinical Delivery Assistance - Reusable Equipment","EQUIPMENT - 4% crude birth rate, 15% of deliveries will take place in health facilities",{"$f":"'Results Dashboard'!S31","v":0},{"$f":"'Results Dashboard'!U31","v":0},{"$f":"'Results Dashboard'!W31","v":0},{"$f":"D10*30000","v":0},{"$f":"D10*300","v":0},{"$f":"D10*45","v":0},{"$f":"E10*30000","v":0},{"$f":"E10*300","v":0},{"$f":"E10*45","v":0},{"$f":"F10*30000","v":0},{"$f":"F10*300","v":0},{"$f":"F10*45","v":0}]
{"$rows_left_out":15}
{"sheet":"Hidden","index":14,"n_rows":73,"n_cols":10,"rows_kept":73,"cut":false,"hidden":true,"merged":[]}
["Results Dashboard "]
[]
[null,null,"Column Labels"]
[null,null,"KIT 1A",null,"KIT 1A Total","Grand Total"]
[null,"Values","Demographic","Logistics"]
[null,"Now - 3 Months",0,0,0,0]
[null,"3 - 6 Months",0,0,0,0]
[null,"6 - 9 Months",0,0,0,0]
[]
[]
{"$rows_left_out":63}